Reaction Details
TargetSolute carrier family 22 member 12
LigandBDBM318946
Substrate/Competitorn/a
Meas. Tech.HEK-URAT1 assay
IC50 21.5±n/a nM
Citation Endo, TKobayashi, KTanaka, HSaito, DHirano, MEndou, HAnzai, N URAT1 inhibitor US Patent US10173990 Publication Date 1/8/2019
 
Solute carrier family 22 member 12
Name:Solute carrier family 22 member 12
Type:Enzyme
Mol. Mass.:59638.65
Organism:Homo sapiens (Human)
Description:Q96S37
Residue:553
BDBM318946
NameBDBM318946
Synonyms:1-[[7-(4-Cyanophenyl)benzo[d]isothiazol-6-yl]thio]cyclobutan-1-carboxylic acid | US10173990, Example 66
TypeSmall organic molecule
Emp. Form.C19H14N2O2S2
Mol. Mass.366.457
SMILESOC(=O)C1(CCC1)Sc1ccc2cnsc2c1-c1ccc(cc1)C#N