Reaction Details
TargetSolute carrier family 22 member 12
LigandBDBM318950
Substrate/Competitorn/a
Meas. Tech.HEK-URAT1 assay
IC50 106±n/a nM
Citation Endo, TKobayashi, KTanaka, HSaito, DHirano, MEndou, HAnzai, N URAT1 inhibitor US Patent US10173990 Publication Date 1/8/2019
 
Solute carrier family 22 member 12
Name:Solute carrier family 22 member 12
Type:Enzyme
Mol. Mass.:59638.65
Organism:Homo sapiens (Human)
Description:Q96S37
Residue:553
BDBM318950
NameBDBM318950
Synonyms:2-[[7-(4-Chlorophenyl)benzo[d]isothiazol-6-yl]thio]-2-methylpropanoic acid | US10173990, Example 82
TypeSmall organic molecule
Emp. Form.C17H14ClNO2S2
Mol. Mass.363.882
SMILESCC(C)(Sc1ccc2cnsc2c1-c1ccc(Cl)cc1)C(O)=O