Reaction Details
TargetSolute carrier family 22 member 12
LigandBDBM318956
Substrate/Competitorn/a
Meas. Tech.HEK-URAT1 assay
IC50 25.0±n/a nM
Citation Endo, TKobayashi, KTanaka, HSaito, DHirano, MEndou, HAnzai, N URAT1 inhibitor US Patent US10173990 Publication Date 1/8/2019
 
Solute carrier family 22 member 12
Name:Solute carrier family 22 member 12
Type:Enzyme
Mol. Mass.:59638.65
Organism:Homo sapiens (Human)
Description:Q96S37
Residue:553
BDBM318956
NameBDBM318956
Synonyms:(E)-3-[[1-(4-cyanophenyl)naphthalen-2-yl]thio]-2-butenoic acid | US10173990, Example 116
TypeSmall organic molecule
Emp. Form.C21H15NO2S
Mol. Mass.345.414
SMILESC\C(Sc1ccc2ccccc2c1-c1ccc(cc1)C#N)=C/C(O)=O