Reaction Details
TargetEndothelial lipase
LigandBDBM318968
Substrate/Competitorn/a
Meas. Tech.Biological Activity
IC50 1.000±n/a nM
Citation Johnson, JAPi, ZQiao, JXKim, SWang, TCJiang, JFinlay, HLloyd, J Sulfone amide linked benzothiazole inhibitors of endothelial lipase US Patent US10173991 Publication Date 1/8/2019
 
Endothelial lipase
Name:Endothelial lipase
Type:Protein
Mol. Mass.:56805.62
Organism:Homo sapiens (Human)
Description:Q9Y5X9
Residue:500
BDBM318968
NameBDBM318968
Synonyms:US10173991, Example 9 | benzyl N-{4-[2- ({[(cyclopropyl- carbamoyl) methyl] carbamoyl} (3,3,3-trifluoro- propanesulfonyl) methyl)-6-fluoro- 1,3-benzothiazol- 5-yl]phenyl} carbamate
TypeSmall organic molecule
Emp. Form.C31H28F4N4O6S2
Mol. Mass.692.701
SMILESFc1cc2sc(nc2cc1-c1ccc(NC(=O)OCc2ccccc2)cc1)C(C(=O)NCC(=O)NC1CC1)S(=O)(=O)CCC(F)(F)F