Reaction Details
TargetEndothelial lipase
LigandBDBM318969
Substrate/Competitorn/a
Meas. Tech.Biological Activity
IC50 1.000±n/a nM
Citation Johnson, JAPi, ZQiao, JXKim, SWang, TCJiang, JFinlay, HLloyd, J Sulfone amide linked benzothiazole inhibitors of endothelial lipase US Patent US10173991 Publication Date 1/8/2019
 
Endothelial lipase
Name:Endothelial lipase
Type:Protein
Mol. Mass.:56805.62
Organism:Homo sapiens (Human)
Description:Q9Y5X9
Residue:500
BDBM318969
NameBDBM318969
Synonyms:US10173991, Example 10 | benzyl N-{4-[2- ({[(cyclopropyl- carbamoyl) methyl] carbamoyl}(2- methoxyethane- sulfonyl)methyl)- 6-fluoro-1,3- benzothiazol-5- yl]phenyl} carbamate
TypeSmall organic molecule
Emp. Form.C31H31FN4O7S2
Mol. Mass.654.729
SMILESOCCCS(=O)(=O)C(C(=O)NCC(=O)NC1CC1)c1nc2cc(c(F)cc2s1)-c1ccc(NC(=O)OCc2ccccc2)cc1