Reaction Details
TargetEndothelial lipase
LigandBDBM318970
Substrate/Competitorn/a
Meas. Tech.Biological Activity
IC50 1.000±n/a nM
Citation Johnson, JAPi, ZQiao, JXKim, SWang, TCJiang, JFinlay, HLloyd, J Sulfone amide linked benzothiazole inhibitors of endothelial lipase US Patent US10173991 Publication Date 1/8/2019
 
Endothelial lipase
Name:Endothelial lipase
Type:Protein
Mol. Mass.:56805.62
Organism:Homo sapiens (Human)
Description:Q9Y5X9
Residue:500
BDBM318970
NameBDBM318970
Synonyms:US10173991, Example 11 | benzyl N-(4-{2- [(cyclopropane- sulfonyl) ({[(cyclopropyl-carbamoyl) methyl] carbamoyl}) methyl]6-fluoro- 1,3- benzothiazol-5-yl}phenyl) carbamate
TypeSmall organic molecule
Emp. Form.C31H29FN4O6S2
Mol. Mass.636.714
SMILESFc1cc2sc(nc2cc1-c1ccc(NC(=O)OCc2ccccc2)cc1)C(C(=O)NCC(=O)NC1CC1)S(=O)(=O)C1CC1