Reaction Details
TargetEndothelial lipase
LigandBDBM319205
Substrate/Competitorn/a
Meas. Tech.Biological Activity
IC50 1.000±n/a nM
Citation Johnson, JAPi, ZQiao, JXKim, SWang, TCJiang, JFinlay, HLloyd, J Sulfone amide linked benzothiazole inhibitors of endothelial lipase US Patent US10173991 Publication Date 1/8/2019
 
Endothelial lipase
Name:Endothelial lipase
Type:Protein
Mol. Mass.:56805.62
Organism:Homo sapiens (Human)
Description:Q9Y5X9
Residue:500
BDBM319205
NameBDBM319205
Synonyms:N-[(cyclopropyl- carbamoyl) methyl]-2-[5- fluoro-6-(2- methyl-1,3- benzothiazol-5- yl)-1,3- benzothiazol-2- yl]-2- methanesulfonyl- acetamide | US10173991, Example 248
TypeSmall organic molecule
Emp. Form.C23H21FN4O4S3
Mol. Mass.532.631
SMILESCc1nc2cc(ccc2s1)-c1cc2sc(nc2cc1F)C(C(=O)NCC(=O)NC1CC1)S(C)(=O)=O