Reaction Details
TargetEndothelial lipase
LigandBDBM319332
Substrate/Competitorn/a
Meas. Tech.Biological Activity
IC50 1.000±n/a nM
Citation Johnson, JAPi, ZQiao, JXKim, SWang, TCJiang, JFinlay, HLloyd, J Sulfone amide linked benzothiazole inhibitors of endothelial lipase US Patent US10173991 Publication Date 1/8/2019
 
Endothelial lipase
Name:Endothelial lipase
Type:Protein
Mol. Mass.:56805.62
Organism:Homo sapiens (Human)
Description:Q9Y5X9
Residue:500
BDBM319332
NameBDBM319332
Synonyms:N-({[2- (benzyloxy)ethyl] carbamoyl} methyl)-2-[6-(6- fluoropyridin-3- yl)-1,3- benzothiazol- 2-yl]-2-(2- methoxyethane- sulfonyl)acetamide | US10173991, Example 377
TypeSmall organic molecule
Emp. Form.C28H29FN4O6S2
Mol. Mass.600.681
SMILESCOCCS(=O)(=O)C(C(=O)NCC(=O)NCCOCc1ccccc1)c1nc2ccc(cc2s1)-c1ccc(F)nc1