Reaction Details
TargetEndothelial lipase
LigandBDBM319442
Substrate/Competitorn/a
Meas. Tech.Biological Activity
IC50 1.000±n/a nM
Citation Johnson, JAPi, ZQiao, JXKim, SWang, TCJiang, JFinlay, HLloyd, J Sulfone amide linked benzothiazole inhibitors of endothelial lipase US Patent US10173991 Publication Date 1/8/2019
 
Endothelial lipase
Name:Endothelial lipase
Type:Protein
Mol. Mass.:56805.62
Organism:Homo sapiens (Human)
Description:Q9Y5X9
Residue:500
BDBM319442
NameBDBM319442
Synonyms:N-[(cyclopropyl- carbamoyl) methyl]-2- (dimethyl- sulfamoyl)-2-[4- fluoro-6-(2- methyl-1-oxo-1,2- dihydro- isoquinolin-6-yl)- 1,3-benzothiazol- 2-yl]acetamide | US10173991, Example 493
TypeSmall organic molecule
Emp. Form.C26H26FN5O5S2
Mol. Mass.571.644
SMILESCN(C)S(=O)(=O)C(C(=O)NCC(=O)NC1CC1)c1nc2c(F)cc(cc2s1)-c1ccc2c(ccn(C)c2=O)c1