Reaction Details
TargetEndothelial lipase
LigandBDBM319469
Substrate/Competitorn/a
Meas. Tech.Biological Activity
IC50 1.000±n/a nM
Citation Johnson, JAPi, ZQiao, JXKim, SWang, TCJiang, JFinlay, HLloyd, J Sulfone amide linked benzothiazole inhibitors of endothelial lipase US Patent US10173991 Publication Date 1/8/2019
 
Endothelial lipase
Name:Endothelial lipase
Type:Protein
Mol. Mass.:56805.62
Organism:Homo sapiens (Human)
Description:Q9Y5X9
Residue:500
BDBM319469
NameBDBM319469
Synonyms:(3-cyanophenyl) methyl N-{4-[2- ({[(cyclopropyl- carbamoyl) methyl] carbamoyl}(3,3,3- trifluoropropane- sulfonyl)methyl)- 5-fluoro-1,3- benzothiazol- 6-yl]phenyl} carbamate | US10173991, Example 522
TypeSmall organic molecule
Emp. Form.C32H27F4N5O6S2
Mol. Mass.717.71
SMILESFc1cc2nc(sc2cc1-c1ccc(NC(=O)OCc2cccc(c2)[N+]#[C-])cc1)C(C(=O)NCC(=O)NC1CC1)S(=O)(=O)CCC(F)(F)F