Reaction Details
TargetEndothelial lipase
LigandBDBM319495
Substrate/Competitorn/a
Meas. Tech.Biological Activity
IC50 1.000±n/a nM
Citation Johnson, JAPi, ZQiao, JXKim, SWang, TCJiang, JFinlay, HLloyd, J Sulfone amide linked benzothiazole inhibitors of endothelial lipase US Patent US10173991 Publication Date 1/8/2019
 
Endothelial lipase
Name:Endothelial lipase
Type:Protein
Mol. Mass.:56805.62
Organism:Homo sapiens (Human)
Description:Q9Y5X9
Residue:500
BDBM319495
NameBDBM319495
Synonyms:US10173991, Example 551 | benzyl N-{5-[2- ({[(cyclopropyl- carbamoyl)methyl] carbamoyl}(2- methoxyethane- sulfonyl)methyl)- 5-fluoro-1,3- benzothiazol-6- yl]pyridin-2-yl} carbamate
TypeSmall organic molecule
Emp. Form.C30H30FN5O7S2
Mol. Mass.655.717
SMILESCOCCS(=O)(=O)C(C(=O)NCC(=O)NC1CC1)c1nc2cc(F)c(cc2s1)-c1ccc(NC(=O)OCc2ccccc2)nc1