Reaction Details
TargetInterleukin-1 receptor-associated kinase 4
LigandBDBM319566
Substrate/Competitorn/a
Meas. Tech.IRAK4 Enzymatic DELFIA Assay, Protocol B
IC50 1.20±n/a nM
Citation Lee, KLAllais, CPDehnhardt, CMGavrin, LKHan, SHepworth, DLee, ALovering, FEMathias, JPOwen, DRPapaioannou, NSaiah, EStrohbach, JWTrzupek, JDWright, SWZapf, CW Bicyclic-fused heteroaryl or aryl compounds as IRAK4 modulators US Patent US10174000 Publication Date 1/8/2019
 
Interleukin-1 receptor-associated kinase 4
Name:Interleukin-1 receptor-associated kinase 4
Type:Protein
Mol. Mass.:51519.08
Organism:Homo sapiens (Human)
Description:Q9NWZ3
Residue:460
BDBM319566
NameBDBM319566
Synonyms:1-(((4S,7R)-7-fluoro-6-oxo-5-azaspiro[2.4]heptan-4-yl)methoxy)-7-isopropoxyisoquinoline-6-carboxamide | US10174000, Example 17
TypeSmall organic molecule
Emp. Form.C20H22FN3O4
Mol. Mass.387.4048
SMILESCC(C)Oc1cc2c(OC[C@H]3NC(=O)[C@H](F)C33CC3)nccc2cc1C(N)=O