Reaction Details
TargetInterleukin-1 receptor-associated kinase 4
LigandBDBM319575
Substrate/Competitorn/a
Meas. Tech.IRAK4 Enzymatic DELFIA Assay, Protocol B
IC50 0.100±n/a nM
Citation Lee, KLAllais, CPDehnhardt, CMGavrin, LKHan, SHepworth, DLee, ALovering, FEMathias, JPOwen, DRPapaioannou, NSaiah, EStrohbach, JWTrzupek, JDWright, SWZapf, CW Bicyclic-fused heteroaryl or aryl compounds as IRAK4 modulators US Patent US10174000 Publication Date 1/8/2019
 
Interleukin-1 receptor-associated kinase 4
Name:Interleukin-1 receptor-associated kinase 4
Type:Protein
Mol. Mass.:51519.08
Organism:Homo sapiens (Human)
Description:Q9NWZ3
Residue:460
BDBM319575
NameBDBM319575
Synonyms:5-(((2S,3S,4S)-3-ethyl-4-fluoro-5-oxopyrrolidin-2-yl)methoxy)-3-methoxy-2-naphthamide | US10174000, Example 27
TypeSmall organic molecule
Emp. Form.C19H21FN2O4
Mol. Mass.360.3794
SMILESCC[C@H]1[C@@H](COc2cccc3cc(C(N)=O)c(OC)cc23)NC(=O)[C@H]1F