Reaction Details
TargetKetohexokinase
LigandBDBM319592
Substrate/Competitorn/a
Meas. Tech.KHK Assay A
IC50 866±n/a nM
Citation Dowling, MFernando, DFutatsugi, KHuard, KMagee, TVRaymer, BShavnya, ASmith, AThuma, BTsai, ATu, M Substituted 3-azabicyclo[3.1.0]hexanes as ketohexokinase inhibitors US Patent US10174007 Publication Date 1/8/2019
 
Ketohexokinase
Name:Ketohexokinase
Type:Enzyme Catalytic Domain
Mol. Mass.:32521.64
Organism:Homo sapiens (Human)
Description:n/a
Residue:298
BDBM319592
NameBDBM319592
Synonyms:US10174007, Example 11 US10988463, Example 11 | US11634410, Example 11
TypeSmall organic molecule
Emp. Form.C16H19F3N8
Mol. Mass.380.3709
SMILESC[C@H]1CCN1c1nc(cc(n1)C(F)(F)F)N1C[C@H]2[C@H](Cc3nnn[nH]3)[C@H]2C1