Reaction Details
TargetKetohexokinase
LigandBDBM319600
Substrate/Competitorn/a
Meas. Tech.KHK Assay D
IC50 12.1±n/a nM
Citation Dowling, MFernando, DFutatsugi, KHuard, KMagee, TVRaymer, BShavnya, ASmith, AThuma, BTsai, ATu, M Substituted 3-azabicyclo[3.1.0]hexanes as ketohexokinase inhibitors US Patent US10174007 Publication Date 1/8/2019
 
Ketohexokinase
Name:Ketohexokinase
Type:Enzyme Catalytic Domain
Mol. Mass.:32521.64
Organism:Homo sapiens (Human)
Description:n/a
Residue:298
BDBM319600
NameBDBM319600
Synonyms:US10174007, Example 24 US11634410, Example 24 | [(1R,5S,6R)-3-{2-[(2S,3R)-3-hydroxy-2-methylazetidin-1-yl]-5-methyl-6-(trifluoromethyl)pyrimidin-4-yl}-3-azabicyclo[3.1.0]hex-6-yl]acetic acid
TypeSmall organic molecule
Emp. Form.C17H21F3N4O3
Mol. Mass.386.3688
SMILESC[C@H]1[C@H](O)CN1c1nc(N2C[C@H]3[C@H](CC(O)=O)[C@H]3C2)c(C)c(n1)C(F)(F)F