Reaction Details
TargetKetohexokinase
LigandBDBM319601
Substrate/Competitorn/a
Meas. Tech.KHK Assay B
IC50 3.70±n/a nM
Citation Dowling, MFernando, DFutatsugi, KHuard, KMagee, TVRaymer, BShavnya, ASmith, AThuma, BTsai, ATu, M Substituted 3-azabicyclo[3.1.0]hexanes as ketohexokinase inhibitors US Patent US10174007 Publication Date 1/8/2019
 
Ketohexokinase
Name:Ketohexokinase
Type:Enzyme Catalytic Domain
Mol. Mass.:32521.64
Organism:Homo sapiens (Human)
Description:n/a
Residue:298
BDBM319601
NameBDBM319601
Synonyms:US10174007, Example 40 US11634410, Example 40 | [(1R,5S,6R)-3-{5-chloro-6-(difluoromethyl)-2-[(2S)-2-methylazetidin-1-yl]pyrimidin-4-yl}-3-azabicyclo[3.1.0]hex-6-yl]acetic acid
TypeSmall organic molecule
Emp. Form.C16H19ClF2N4O2
Mol. Mass.372.797
SMILESC[C@H]1CCN1c1nc(C(F)F)c(Cl)c(n1)N1C[C@H]2[C@H](CC(O)=O)[C@H]2C1