Reaction Details
TargetKetohexokinase
LigandBDBM319603
Substrate/Competitorn/a
Meas. Tech.KHK Assay B
IC50 8.00±n/a nM
Citation Dowling, MFernando, DFutatsugi, KHuard, KMagee, TVRaymer, BShavnya, ASmith, AThuma, BTsai, ATu, M Substituted 3-azabicyclo[3.1.0]hexanes as ketohexokinase inhibitors US Patent US10174007 Publication Date 1/8/2019
 
Ketohexokinase
Name:Ketohexokinase
Type:Enzyme Catalytic Domain
Mol. Mass.:32521.64
Organism:Homo sapiens (Human)
Description:n/a
Residue:298
BDBM319603
NameBDBM319603
Synonyms:US10174007, Example 43 US11634410, Example 43 | [(1R,5S,6R)-3-{6-(difluoromethyl)-5-methyl-2-[(2S)-2-methylazetidin-1-yl]pyrimidin-4-yl}-3-azabicyclo[3.1.0]hex-6-yl]acetic acid
TypeSmall organic molecule
Emp. Form.C17H22F2N4O2
Mol. Mass.352.379
SMILESC[C@H]1CCN1c1nc(C(F)F)c(C)c(n1)N1C[C@H]2[C@H](CC(O)=O)[C@H]2C1