Reaction Details
TargetD(2) dopamine receptor
LigandBDBM319719
Substrate/Competitorn/a
Meas. Tech.D2 Receptor Antagonism Activity Test
IC50 1.84±n/a nM
Citation Jiang, HWang, ZLi, JZhang, RHe, YLiu, YBi, MLiu, ZTian, GChen, WYang, FWu, CWang, YJiang, XYin, JWang, GShen, J Heterocyclic compounds, process for preparation of the same and use thereof US Patent US10174011 Publication Date 1/8/2019
 
D(2) dopamine receptor
Name:D(2) dopamine receptor
Type:Cell-surface receptors
Mol. Mass.:50647.10
Organism:Homo sapiens (Human)
Description:P14416
Residue:443
BDBM319719
NameBDBM319719
Synonyms:5-(4-(4-(2-fluorobenzo[b]thiophen-4-yl)piperazin-1-yl)butyl)indolin-2-one | US10174011, Example 101
TypeSmall organic molecule
Emp. Form.C24H26FN3OS
Mol. Mass.423.546
SMILESFc1cc2c(cccc2s1)N1CCN(CCCCc2ccc3NC(=O)Cc3c2)CC1