Reaction Details
Target5-hydroxytryptamine receptor 2A
LigandBDBM319751
Substrate/Competitorn/a
Meas. Tech.5-HT2A Receptor Antagonism Activity Test
IC50 1.61±n/a nM
Citation Jiang, HWang, ZLi, JZhang, RHe, YLiu, YBi, MLiu, ZTian, GChen, WYang, FWu, CWang, YJiang, XYin, JWang, GShen, J Heterocyclic compounds, process for preparation of the same and use thereof US Patent US10174011 Publication Date 1/8/2019
 
5-hydroxytryptamine receptor 2A
Name:5-hydroxytryptamine receptor 2A
Type:undefined
Mol. Mass.:52607.65
Organism:Homo sapiens (Human)
Description:P28223
Residue:471
BDBM319751
NameBDBM319751
Synonyms:6-(2-(4-(benzo[b]thiophen-4-yl)piperazin-1-yl)ethyl)benzo[d]thiazol-2-amine | US10174011, Example 154
TypeSmall organic molecule
Emp. Form.C21H22N4S2
Mol. Mass.394.556
SMILESNc1nc2ccc(CCN3CCN(CC3)c3cccc4sccc34)cc2s1