Reaction Details
TargetP2X purinoceptor 3
LigandBDBM319841
Substrate/Competitorn/a
Meas. Tech.Intracellular Calcium Measurement to Assess Antagonist Activity at Human P2X3 and Human P2X2/3 Receptors
IC50 3.00±n/a nM
Citation Davenport, AJBräuer, NFischer, OMRotgeri, ARottmann, ANeagoe, INagel, JGodinho-Coelho, AKlar, J 1,3-thiazol-2-yl substituted benzamides US Patent US10174016 Publication Date 1/8/2019
 
P2X purinoceptor 3
Name:P2X purinoceptor 3
Type:Protein
Mol. Mass.:44292.02
Organism:Homo sapiens (Human)
Description:P56373
Residue:397
BDBM319841
NameBDBM319841
Synonyms:3-(Cyclopropylmethoxy)-N-[(1R)-1-(6-methylpyridazin-3-yl)ethyl]-5-(5-methyl-1,3-thiazol-2-yl)benzamide US10202369, Example 8 | US10472354, Example 8
TypeSmall organic molecule
Emp. Form.C22H24N4O2S
Mol. Mass.408.517
SMILESC[C@@H](NC(=O)c1cc(OCC2CC2)cc(c1)-c1ncc(C)s1)c1ccc(C)nn1