Reaction Details
TargetP2X purinoceptor 2
LigandBDBM319932
Substrate/Competitorn/a
Meas. Tech.Intracellular Calcium Measurement to Assess Antagonist Activity at Human P2X3 and Human P2X2/3 Receptors
IC50 27.0±n/a nM
Citation Davenport, AJBräuer, NFischer, OMRotgeri, ARottmann, ANeagoe, INagel, JGodinho-Coelho, AKlar, J 1,3-thiazol-2-yl substituted benzamides US Patent US10174016 Publication Date 1/8/2019
 
P2X purinoceptor 2
Name:P2X purinoceptor 2
Type:Enzyme Catalytic Domain
Mol. Mass.:51765.18
Organism:Homo sapiens (Human)
Description:PurinergicP2X2/3 0 HUMAN::Q9UBL9
Residue:471
BDBM319932
NameBDBM319932
Synonyms:N-[(1R)-1-(6- Methyl- pyridazin-3- yl)ethyl]-3- (5-methyl- 1,3-thiazol-2- yl)-5- (tetrahydro- 2H-pyran-4- ylmethoxy) benzamide US10202369, Example 99 | US10472354, Example 99
TypeSmall organic molecule
Emp. Form.C24H28N4O3S
Mol. Mass.452.569
SMILESC[C@@H](NC(=O)c1cc(OCC2CCOCC2)cc(c1)-c1ncc(C)s1)c1ccc(C)nn1