Reaction Details
TargetP2X purinoceptor 2
LigandBDBM319933
Substrate/Competitorn/a
Meas. Tech.Intracellular Calcium Measurement to Assess Antagonist Activity at Human P2X3 and Human P2X2/3 Receptors
IC50 16.0±n/a nM
Citation Davenport, AJBräuer, NFischer, OMRotgeri, ARottmann, ANeagoe, INagel, JGodinho-Coelho, AKlar, J 1,3-thiazol-2-yl substituted benzamides US Patent US10174016 Publication Date 1/8/2019
 
P2X purinoceptor 2
Name:P2X purinoceptor 2
Type:Enzyme Catalytic Domain
Mol. Mass.:51765.18
Organism:Homo sapiens (Human)
Description:PurinergicP2X2/3 0 HUMAN::Q9UBL9
Residue:471
BDBM319933
NameBDBM319933
Synonyms:N-[(1R)-1-(6- Methyl- pyridazin-3- yl)ethyl]-3- [(2- methylpyridin- 4-yl)oxy]-5- (5-methyl- 1,3-thiazol-2- yl)benzamide US10202369, Example 100 | US10472354, Example 100
TypeSmall organic molecule
Emp. Form.C24H23N5O2S
Mol. Mass.445.537
SMILESC[C@@H](NC(=O)c1cc(Oc2ccnc(C)c2)cc(c1)-c1ncc(C)s1)c1ccc(C)nn1