Reaction Details
TargetP2X purinoceptor 3
LigandBDBM320006
Substrate/Competitorn/a
Meas. Tech.Intracellular Calcium Measurement to Assess Antagonist Activity at Human P2X3 and Human P2X2/3 Receptors
IC50 5.00±n/a nM
Citation Davenport, AJBräuer, NFischer, OMRotgeri, ARottmann, ANeagoe, INagel, JGodinho-Coelho, AKlar, J 1,3-thiazol-2-yl substituted benzamides US Patent US10174016 Publication Date 1/8/2019
 
P2X purinoceptor 3
Name:P2X purinoceptor 3
Type:Protein
Mol. Mass.:44292.02
Organism:Homo sapiens (Human)
Description:P56373
Residue:397
BDBM320006
NameBDBM320006
Synonyms:3-[(3S)-1- azabicyclo[2.2.2] oct-3-yloxy]-5-(5- ethyl-1,3-thiazol- 2-yl)-N-{(1R)-1-[2- (trifluoromethyl) pyrimidin-5- yl]ethyl}benzamide US10202369, Example 173 | US10472354, Example 173
TypeSmall organic molecule
Emp. Form.C26H28F3N5O2S
Mol. Mass.531.593
SMILESCCc1cnc(s1)-c1cc(O[C@@H]2CN3CCC2CC3)cc(c1)C(=O)N[C@H](C)c1cnc(nc1)C(F)(F)F