Reaction Details
TargetP2X purinoceptor 3
LigandBDBM320056
Substrate/Competitorn/a
Meas. Tech.Intracellular Calcium Measurement to Assess Antagonist Activity at Human P2X3 and Human P2X2/3 Receptors
IC50 3.00±n/a nM
Citation Davenport, AJBräuer, NFischer, OMRotgeri, ARottmann, ANeagoe, INagel, JGodinho-Coelho, AKlar, J 1,3-thiazol-2-yl substituted benzamides US Patent US10174016 Publication Date 1/8/2019
 
P2X purinoceptor 3
Name:P2X purinoceptor 3
Type:Protein
Mol. Mass.:44292.02
Organism:Homo sapiens (Human)
Description:P56373
Residue:397
BDBM320056
NameBDBM320056
Synonyms:US10174016, Example 223
TypeSmall organic molecule
Emp. Form.C25H25F6N5O2S
Mol. Mass.573.554
SMILESC[C@@H](NC(=O)c1cc(O[C@H]2CCN(C)C(C2)C(F)(F)F)cc(c1)-c1ncc(C)s1)c1cnc(nc1)C(F)(F)F