Reaction Details
TargetCoagulation factor XI
LigandBDBM320256
Substrate/Competitorn/a
Meas. Tech.In Vitro Inhibitory Effect of the Compounds of the Present Invention on the Enzymatic Activity of Blood-Coagulation Factor XIa
Ki 17.0±n/a nM
Citation Wei, YQiu, GZheng, SLei, BYu, YChen, Y Pyridone or pyrimidone derivative, preparation method therefor and application thereof US Patent US10174020 Publication Date 1/8/2019
 
Coagulation factor XI
Name:Coagulation factor XI
Type:Enzyme
Mol. Mass.:70130.58
Organism:Homo sapiens (Human)
Description:P03951
Residue:625
BDBM320256
NameBDBM320256
Synonyms:N-(2-carboxyindol-5-yl)-2-(5-chloro-2-(1H-tetrazol-1-yl)phenyl)-4-oxo-4,6,7,8-tetrahydropyrrolo[1,2-a]pyrimidine-6-carboxamide | US10174020, Compound 4
TypeSmall organic molecule
Emp. Form.C28H25ClN8O4
Mol. Mass.573.002
SMILESCC(C)(C)OC(=O)c1cc2cc(NC(=O)C3CCc4nc(cc(=O)n34)-c3cc(Cl)ccc3-n3cnnn3)ccc2[nH]1