Reaction Details
TargetCoagulation factor XI
LigandBDBM320258
Substrate/Competitorn/a
Meas. Tech.In Vitro Inhibitory Effect of the Compounds of the Present Invention on the Enzymatic Activity of Blood-Coagulation Factor XIa
Ki 14.0±n/a nM
Citation Wei, YQiu, GZheng, SLei, BYu, YChen, Y Pyridone or pyrimidone derivative, preparation method therefor and application thereof US Patent US10174020 Publication Date 1/8/2019
 
Coagulation factor XI
Name:Coagulation factor XI
Type:Enzyme
Mol. Mass.:70130.58
Organism:Homo sapiens (Human)
Description:P03951
Residue:625
BDBM320258
NameBDBM320258
Synonyms:N-(2-carboxyindol-5-yl)-2-(4-(5-chloro-2-(1H-tetrazol-1-yl)phenyl))-2-oxo-pyridin-1-yl)acetamide | US10174020, Compound 6
TypeSmall organic molecule
Emp. Form.C27H24ClN7O4
Mol. Mass.545.977
SMILESCC(C)(C)OC(=O)c1cc2cc(NC(=O)Cn3ccc(cc3=O)-c3cc(Cl)ccc3-n3cnnn3)ccc2[nH]1