Reaction Details
TargetCoagulation factor XI
LigandBDBM320260
Substrate/Competitorn/a
Meas. Tech.In Vitro Inhibitory Effect of the Compounds of the Present Invention on the Enzymatic Activity of Blood-Coagulation Factor XIa
Ki 2.00±n/a nM
Citation Wei, YQiu, GZheng, SLei, BYu, YChen, Y Pyridone or pyrimidone derivative, preparation method therefor and application thereof US Patent US10174020 Publication Date 1/8/2019
 
Coagulation factor XI
Name:Coagulation factor XI
Type:Enzyme
Mol. Mass.:70130.58
Organism:Homo sapiens (Human)
Description:P03951
Residue:625
BDBM320260
NameBDBM320260
Synonyms:US10174020, Compound 8-1
TypeSmall organic molecule
Emp. Form.C25H18ClN7O4
Mol. Mass.515.908
SMILESOC(=O)c1cc2cc(NC(=O)[C@@H]3CCc4cc(cc(=O)n34)-c3cc(Cl)ccc3-n3cnnn3)ccc2[nH]1