Reaction Details
TargetPoly [ADP-ribose] polymerase 1
LigandBDBM320266
Substrate/Competitorn/a
Meas. Tech.HT Universal Chemiluminescent PARP Assay Kit
IC50 1.000±n/a nM
Citation Fan, XQin, J Heterocyclic-imidazole compounds, pharmaceutical compositions thereof, preparation method therefor and use thereof US Patent US10174023 Publication Date 1/8/2019
 
Poly [ADP-ribose] polymerase 1
Name:Poly [ADP-ribose] polymerase 1
Type:n/a
Mol. Mass.:113114.22
Organism:Homo sapiens (Human)
Description:P09874
Residue:1014
BDBM320266
NameBDBM320266
Synonyms:4-(3-(4-(1H-imidazo[4,5-b]pyridin-5-yl)piperazine-1-carbonyl)-4-fluorobenzyl)phthalazin-1(2H)-one | US10174023, Compound (4)
TypeSmall organic molecule
Emp. Form.C26H22FN7O2
Mol. Mass.483.497
SMILESFc1ccc(Cc2n[nH]c(=O)c3ccccc23)cc1C(=O)N1CCN(CC1)c1ccc2[nH]cnc2n1