Reaction Details
TargetcGMP-dependent 3',5'-cyclic phosphodiesterase
LigandBDBM320774
Substrate/Competitorn/a
Meas. Tech.Lab B PDE2 assay
Ki 0.058±n/a nM
Citation Shen, DDwyer, MPSinz, CJWang, DStachel, SJPaone, DVForster, ABerger, RChen, YQian, YXu, SHu, C Dihydropyrazolopyrimidinone compounds as PDE2 inhibitors US Patent US10174037 Publication Date 1/8/2019
 
cGMP-dependent 3',5'-cyclic phosphodiesterase
Name:cGMP-dependent 3',5'-cyclic phosphodiesterase
Type:Enzyme Catalytic Domain
Mol. Mass.:105691.58
Organism:Homo sapiens (Human)
Description:O00408
Residue:941
BDBM320774
NameBDBM320774
Synonyms:(R)- or (S)-1-(Cyclopropyl(3-fluoro-4- (trifluoromethyl)phenyl)methyl)-6- (dimethylamino)-3-(fluoromethyl)-1H- pyrazolo[3,4-d]pyrimidin-4(5H)-one US10174037, Example 181
TypeSmall organic molecule
Emp. Form.C19H18F5N5O
Mol. Mass.427.3711
SMILESCN(C)c1nc2n(nc(CF)c2c(=O)[nH]1)C(C1CC1)c1ccc(c(F)c1)C(F)(F)F