Reaction Details
TargetcGMP-dependent 3',5'-cyclic phosphodiesterase
LigandBDBM320776
Substrate/Competitorn/a
Meas. Tech.Lab B PDE2 assay
Ki 0.064±n/a nM
Citation Shen, DDwyer, MPSinz, CJWang, DStachel, SJPaone, DVForster, ABerger, RChen, YQian, YXu, SHu, C Dihydropyrazolopyrimidinone compounds as PDE2 inhibitors US Patent US10174037 Publication Date 1/8/2019
 
cGMP-dependent 3',5'-cyclic phosphodiesterase
Name:cGMP-dependent 3',5'-cyclic phosphodiesterase
Type:Enzyme Catalytic Domain
Mol. Mass.:105691.58
Organism:Homo sapiens (Human)
Description:O00408
Residue:941
BDBM320776
NameBDBM320776
Synonyms:(R)- or (S)-1-(Cyclopropyl(3-fluoro-4- (trifluoromethyl)phenyl)methyl)-6- (dimethylamino)-3-(fluoromethyl)-1H- pyrazolo[3,4-d]pyrimidin-4(5H)-one US10174037, Example 183
TypeSmall organic molecule
Emp. Form.C21H26FN5O
Mol. Mass.383.4624
SMILESCC(C)c1ccc(cc1)C(C1CC1)n1nc(CF)c2c1nc([nH]c2=O)N(C)C