Reaction Details
TargetNeutrophil collagenase
LigandBDBM11360
Substrate/CompetitorBDBM11446
Meas. Tech.Carbonic Anhydrase Enzyme Inhibition Assay
Ki 0.3±n/a nM
Citation Scozzafava, ASupuran, CT Carbonic anhydrase and matrix metalloproteinase inhibitors: sulfonylated amino acid hydroxamates with MMP inhibitory properties act as efficient inhibitors of CA isozymes I, II, and IV, and N-hydroxysulfonamides inhibit both these zinc enzymes. J Med Chem43:3677-87 (2000) 
 
Neutrophil collagenase
Name:Neutrophil collagenase
Type:Enzyme
Mol. Mass.:53413.48
Organism:Homo sapiens (Human)
Description:P22894
Residue:467
BDBM11360
BDBM11446
NameBDBM11360
Synonyms:Hydroxamate 41 | N-hydroxy-2-{[(4-nitrophenyl)methyl](2,3,4,5,6-pentafluorobenzene)sulfonamido}propanamide
TypeSmall organic molecule
Emp. Form.C16H12F5N3O6S
Mol. Mass.469.34
SMILESCC(N(Cc1ccc(cc1)N(=O)=O)S(=O)(=O)c1c(F)c(F)c(F)c(F)c1F)C(=O)NO