Reaction Details
TargetCollagenase ColG
LigandBDBM11342
Substrate/CompetitorBDBM11462
Meas. Tech.Carbonic Anhydrase Enzyme Inhibition Assay
Ki 10±n/a nM
Citation Scozzafava, ASupuran, CT Carbonic anhydrase and matrix metalloproteinase inhibitors: sulfonylated amino acid hydroxamates with MMP inhibitory properties act as efficient inhibitors of CA isozymes I, II, and IV, and N-hydroxysulfonamides inhibit both these zinc enzymes. J Med Chem43:3677-87 (2000) 
 
Collagenase ColG
Name:Collagenase ColG
Type:Enzyme
Mol. Mass.:126246.16
Organism:Clostridium histolyticum
Description:Q9S0X0
Residue:1118
BDBM11342
BDBM11462
NameBDBM11342
Synonyms:2-[benzyl(1,1,2,2,3,3,4,4,4-nonafluorobutane)sulfonamido]-N-hydroxy-3-methylbutanamide | Hydroxamate 22
TypeSmall organic molecule
Emp. Form.C16H17F9N2O4S
Mol. Mass.504.368
SMILESCC(C)C(N(Cc1ccccc1)S(=O)(=O)C(F)(F)C(F)(F)C(F)(F)C(F)(F)F)C(=O)NO