Reaction Details
TargetCollagenase ColG
LigandBDBM11348
Substrate/CompetitorBDBM11462
Meas. Tech.Carbonic Anhydrase Enzyme Inhibition Assay
Ki 5±n/a nM
Citation Scozzafava, ASupuran, CT Carbonic anhydrase and matrix metalloproteinase inhibitors: sulfonylated amino acid hydroxamates with MMP inhibitory properties act as efficient inhibitors of CA isozymes I, II, and IV, and N-hydroxysulfonamides inhibit both these zinc enzymes. J Med Chem43:3677-87 (2000) 
 
Collagenase ColG
Name:Collagenase ColG
Type:Enzyme
Mol. Mass.:126246.16
Organism:Clostridium histolyticum
Description:Q9S0X0
Residue:1118
BDBM11348
BDBM11462
NameBDBM11348
Synonyms:2-[benzyl(2,3,4,5,6-pentafluorobenzene)sulfonamido]-N-hydroxy-4-methylpentanamide | Hydroxamate 29
TypeSmall organic molecule
Emp. Form.C19H19F5N2O4S
Mol. Mass.466.422
SMILESCC(C)CC(N(Cc1ccccc1)S(=O)(=O)c1c(F)c(F)c(F)c(F)c1F)C(=O)NO