Reaction Details
TargetCollagenase ColG
LigandBDBM11349
Substrate/CompetitorBDBM11462
Meas. Tech.Carbonic Anhydrase Enzyme Inhibition Assay
Ki 13±n/a nM
Citation Scozzafava, ASupuran, CT Carbonic anhydrase and matrix metalloproteinase inhibitors: sulfonylated amino acid hydroxamates with MMP inhibitory properties act as efficient inhibitors of CA isozymes I, II, and IV, and N-hydroxysulfonamides inhibit both these zinc enzymes. J Med Chem43:3677-87 (2000) 
 
Collagenase ColG
Name:Collagenase ColG
Type:Enzyme
Mol. Mass.:126246.16
Organism:Clostridium histolyticum
Description:Q9S0X0
Residue:1118
BDBM11349
BDBM11462
NameBDBM11349
Synonyms:2-[benzyl(4-methoxybenzene)sulfonamido]-N-hydroxy-4-methylpentanamide | Hydroxamate 30
TypeSmall organic molecule
Emp. Form.C20H26N2O5S
Mol. Mass.406.496
SMILESCOc1ccc(cc1)S(=O)(=O)N(Cc1ccccc1)C(CC(C)C)C(=O)NO