Reaction Details
TargetCollagenase ColG
LigandBDBM11356
Substrate/CompetitorBDBM11462
Meas. Tech.Carbonic Anhydrase Enzyme Inhibition Assay
Ki 10±n/a nM
Citation Scozzafava, ASupuran, CT Carbonic anhydrase and matrix metalloproteinase inhibitors: sulfonylated amino acid hydroxamates with MMP inhibitory properties act as efficient inhibitors of CA isozymes I, II, and IV, and N-hydroxysulfonamides inhibit both these zinc enzymes. J Med Chem43:3677-87 (2000) 
 
Collagenase ColG
Name:Collagenase ColG
Type:Enzyme
Mol. Mass.:126246.16
Organism:Clostridium histolyticum
Description:Q9S0X0
Residue:1118
BDBM11356
BDBM11462
NameBDBM11356
Synonyms:Hydroxamate 37 | N-hydroxy-2-{[(2-nitrophenyl)methyl](1,1,2,2,3,3,4,4,4-nonafluorobutane)sulfonamido}propanamide
TypeSmall organic molecule
Emp. Form.C14H12F9N3O6S
Mol. Mass.521.312
SMILESCC(N(Cc1ccccc1N(=O)=O)S(=O)(=O)C(F)(F)C(F)(F)C(F)(F)C(F)(F)F)C(=O)NO