Reaction Details
TargetCollagenase ColG
LigandBDBM11362
Substrate/CompetitorBDBM11462
Meas. Tech.Carbonic Anhydrase Enzyme Inhibition Assay
Ki 11±n/a nM
Citation Scozzafava, ASupuran, CT Carbonic anhydrase and matrix metalloproteinase inhibitors: sulfonylated amino acid hydroxamates with MMP inhibitory properties act as efficient inhibitors of CA isozymes I, II, and IV, and N-hydroxysulfonamides inhibit both these zinc enzymes. J Med Chem43:3677-87 (2000) 
 
Collagenase ColG
Name:Collagenase ColG
Type:Enzyme
Mol. Mass.:126246.16
Organism:Clostridium histolyticum
Description:Q9S0X0
Residue:1118
BDBM11362
BDBM11462
NameBDBM11362
Synonyms:2-{[(2-chlorophenyl)methyl](1,1,2,2,3,3,4,4,4-nonafluorobutane)sulfonamido}-N-hydroxypropanamide hydroxamate deriv. B4
TypeSmall organic molecule
Emp. Form.C14H12ClF9N2O4S
Mol. Mass.510.76
SMILESCC(N(Cc1ccccc1Cl)S(=O)(=O)C(F)(F)C(F)(F)C(F)(F)C(F)(F)F)C(=O)NO