Reaction Details
TargetCarbonic anhydrase 2
LigandBDBM11392
Substrate/CompetitorBDBM10856
Meas. Tech.CA Inhibition Assay
pH7.2±n/a
Temperature277.15±n/a K
IC50 1.28±n/a nM
Citation Chen, HHGross, SLiao, JMcLaughlin, MDean, TSly, WSMay, JA 2H-Thieno[3,2-e]- and [2,3-e]-1,2-thiazine-6-sulfonamide 1,1-dioxides as ocular hypotensive agents: synthesis, carbonic anhydrase inhibition and evaluation in the rabbit. Bioorg Med Chem8:957-75 (2000) 
 
Carbonic anhydrase 2
Name:Carbonic anhydrase 2
Type:Enzyme
Mol. Mass.:29250.71
Organism:Homo sapiens (Human)
Description:P00918
Residue:260
BDBM11392
BDBM10856
NameBDBM11392
Synonyms:(4R)-4-amino-2-(3-methoxypropyl)-1,1-dioxo-2H,3H,4H-1,7,2-thieno[3,2-e][1,2]thiazine-6-sulfonamide | AL-8520
TypeSmall organic molecule
Emp. Form.C10H17N3O5S3
Mol. Mass.355.454
SMILESCOCCCN1C[C@H](N)c2cc(sc2S1(=O)=O)S(N)(=O)=O