Reaction Details
TargetCarbonic anhydrase 2
LigandBDBM11393
Substrate/CompetitorBDBM10856
Meas. Tech.CA Inhibition Assay
pH7.2±n/a
Temperature277.15±n/a K
IC50 0.91±n/a nM
Citation Chen, HHGross, SLiao, JMcLaughlin, MDean, TSly, WSMay, JA 2H-Thieno[3,2-e]- and [2,3-e]-1,2-thiazine-6-sulfonamide 1,1-dioxides as ocular hypotensive agents: synthesis, carbonic anhydrase inhibition and evaluation in the rabbit. Bioorg Med Chem8:957-75 (2000) 
 
Carbonic anhydrase 2
Name:Carbonic anhydrase 2
Type:Enzyme
Mol. Mass.:29250.71
Organism:Homo sapiens (Human)
Description:P00918
Residue:260
BDBM11393
BDBM10856
NameBDBM11393
Synonyms:2-[2-[Bis(2-methoxyethyl)amino]ethyl]-2H-thieno[3,2-e]-1,2-thiazine-6-sulfonamide 1,1-dioxide hydrochloride 2H-Thieno[3,2-e]-1,2-thiazine-6-sulfonamide 1,1-dioxide 1 | compound 5a
TypeSmall organic molecule
Emp. Form.C14H23N3O6S3
Mol. Mass.425.544
SMILESCOCCN(CCOC)CCN1C=Cc2cc(sc2S1(=O)=O)S(N)(=O)=O