Reaction Details
TargetCarbonic anhydrase 2
LigandBDBM11398
Substrate/CompetitorBDBM10856
Meas. Tech.CA Inhibition Assay
pH7.2±n/a
Temperature277.15±n/a K
IC50 1.17±n/a nM
Citation Chen, HHGross, SLiao, JMcLaughlin, MDean, TSly, WSMay, JA 2H-Thieno[3,2-e]- and [2,3-e]-1,2-thiazine-6-sulfonamide 1,1-dioxides as ocular hypotensive agents: synthesis, carbonic anhydrase inhibition and evaluation in the rabbit. Bioorg Med Chem8:957-75 (2000) 
 
Carbonic anhydrase 2
Name:Carbonic anhydrase 2
Type:Enzyme
Mol. Mass.:29250.71
Organism:Homo sapiens (Human)
Description:P00918
Residue:260
BDBM11398
BDBM10856
NameBDBM11398
Synonyms:2H-Thieno[3,2-e]-1,2-thiazine-6-sulfonamide 1,1-dioxide 8 3-{[(2-methoxyethyl)(methyl)amino]methyl}-2-methyl-1,1-dioxo-2H-1,7,2-thieno[3,2-e][1,2]thiazine-6-sulfonamide | Compound 17a6
TypeSmall organic molecule
Emp. Form.C12H19N3O5S3
Mol. Mass.381.491
SMILESCOCCN(C)CC1=Cc2cc(sc2S(=O)(=O)N1C)S(N)(=O)=O