Reaction Details
TargetCarbonic anhydrase 2
LigandBDBM11401
Substrate/CompetitorBDBM10856
Meas. Tech.CA Inhibition Assay
pH7.2±n/a
Temperature277.15±n/a K
IC50 1.04±n/a nM
Citation Chen, HHGross, SLiao, JMcLaughlin, MDean, TSly, WSMay, JA 2H-Thieno[3,2-e]- and [2,3-e]-1,2-thiazine-6-sulfonamide 1,1-dioxides as ocular hypotensive agents: synthesis, carbonic anhydrase inhibition and evaluation in the rabbit. Bioorg Med Chem8:957-75 (2000) 
 
Carbonic anhydrase 2
Name:Carbonic anhydrase 2
Type:Enzyme
Mol. Mass.:29250.71
Organism:Homo sapiens (Human)
Description:P00918
Residue:260
BDBM11401
BDBM10856
NameBDBM11401
Synonyms:2-Ethyl-3-[[bis(2-methoxyethyl)amino]methyl]-2H-thieno-[3,2-e]-1,2-thiazine-6-sulfonamide 1,1-dioxide hydrochloride 3-{[bis(2-methoxyethyl)amino]methyl}-2-ethyl-1,1-dioxo-2H-1,7,2-thieno[3,2-e][1,2]thiazine-6-sulfonamide hydrochloride | Compound 17b2
TypeSmall organic molecule
Emp. Form.C15H25N3O6S3
Mol. Mass.439.571
SMILESCCN1C(CN(CCOC)CCOC)=Cc2cc(sc2S1(=O)=O)S(N)(=O)=O