Reaction Details
TargetCarbonic anhydrase 2
LigandBDBM11395
Substrate/CompetitorBDBM11402
Meas. Tech.In vitro binding of inhibitor to hCA-II
pH7.4±n/a
Temperature310.15±n/a K
Ki 0.25±0.02 nM
Citation Chen, HHGross, SLiao, JMcLaughlin, MDean, TSly, WSMay, JA 2H-Thieno[3,2-e]- and [2,3-e]-1,2-thiazine-6-sulfonamide 1,1-dioxides as ocular hypotensive agents: synthesis, carbonic anhydrase inhibition and evaluation in the rabbit. Bioorg Med Chem8:957-75 (2000) 
 
Carbonic anhydrase 2
Name:Carbonic anhydrase 2
Type:Enzyme
Mol. Mass.:29250.71
Organism:Homo sapiens (Human)
Description:P00918
Residue:260
BDBM11395
BDBM11402
NameBDBM11395
Synonyms:2-[2-(4-acetylpiperazin-1-yl)ethyl]-1,1-dioxo-2H-1,7,2-thieno[3,2-e][1,2]thiazine-6-sulfonamide 2H-Thieno[3,2-e]-1,2-thiazine-6-sulfonamide 1,1-dioxide 3 | Compound 5c
TypeSmall organic molecule
Emp. Form.C14H20N4O5S3
Mol. Mass.420.527
SMILESCC(=O)N1CCN(CCN2C=Cc3cc(sc3S2(=O)=O)S(N)(=O)=O)CC1