Reaction Details
TargetCarbonic anhydrase 2
LigandBDBM11403
Substrate/CompetitorBDBM11402
Meas. Tech.In vitro binding of inhibitor to hCA-II
pH7.4±n/a
Temperature310.15±n/a K
Ki 0.24±0.06 nM
Citation Chen, HHGross, SLiao, JMcLaughlin, MDean, TSly, WSMay, JA 2H-Thieno[3,2-e]- and [2,3-e]-1,2-thiazine-6-sulfonamide 1,1-dioxides as ocular hypotensive agents: synthesis, carbonic anhydrase inhibition and evaluation in the rabbit. Bioorg Med Chem8:957-75 (2000) 
 
Carbonic anhydrase 2
Name:Carbonic anhydrase 2
Type:Enzyme
Mol. Mass.:29250.71
Organism:Homo sapiens (Human)
Description:P00918
Residue:260
BDBM11403
BDBM11402
NameBDBM11403
Synonyms:2-[(2E)-4-(morpholin-4-yl)but-2-en-1-yl]-1,1-dioxo-2H-1,7,2-thieno[3,2-e][1,2]thiazine-6-sulfonamide hydrochloride 2H-Thieno[3,2-e]-1,2-thiazine-6-sulfonamide 1,1-dioxide 5 | Compound 5e
TypeSmall organic molecule
Emp. Form.C14H19N3O5S3
Mol. Mass.405.513
SMILESNS(=O)(=O)c1cc2C=CN(C\C=C\CN3CCOCC3)S(=O)(=O)c2s1