Reaction Details
TargetCarbonic anhydrase 2
LigandBDBM11406
Substrate/CompetitorBDBM10856
Meas. Tech.CA Inhibition Assay
IC50 1.24±n/a nM
Citation Chen, HHGross, SLiao, JMcLaughlin, MDean, TSly, WSMay, JA 2H-Thieno[3,2-e]- and [2,3-e]-1,2-thiazine-6-sulfonamide 1,1-dioxides as ocular hypotensive agents: synthesis, carbonic anhydrase inhibition and evaluation in the rabbit. Bioorg Med Chem8:957-75 (2000) 
 
Carbonic anhydrase 2
Name:Carbonic anhydrase 2
Type:Enzyme
Mol. Mass.:29250.71
Organism:Homo sapiens (Human)
Description:P00918
Residue:260
BDBM11406
BDBM10856
NameBDBM11406
Synonyms:2H-Thieno[3,2-e]-1,2-thiazine-6-sulfonamide 1,1-dioxide 13 3-[(4-Morpholinyl)methyl]-2-propyl-2H-thieno[3,2-e]-1,2-thiazine-6-sulfonamide 1,1-dioxide hydrochloride | Compound 17c1
TypeSmall organic molecule
Emp. Form.C14H21N3O5S3
Mol. Mass.407.529
SMILESCCCN1C(CN2CCOCC2)=Cc2cc(sc2S1(=O)=O)S(N)(=O)=O