Reaction Details
TargetCarbonic anhydrase 2
LigandBDBM11417
Substrate/CompetitorBDBM10856
Meas. Tech.CA Inhibition Assay
IC50 3.12±n/a nM
Citation Chen, HHGross, SLiao, JMcLaughlin, MDean, TSly, WSMay, JA 2H-Thieno[3,2-e]- and [2,3-e]-1,2-thiazine-6-sulfonamide 1,1-dioxides as ocular hypotensive agents: synthesis, carbonic anhydrase inhibition and evaluation in the rabbit. Bioorg Med Chem8:957-75 (2000) 
 
Carbonic anhydrase 2
Name:Carbonic anhydrase 2
Type:Enzyme
Mol. Mass.:29250.71
Organism:Homo sapiens (Human)
Description:P00918
Residue:260
BDBM11417
BDBM10856
NameBDBM11417
Synonyms:2H-Thieno[3,2-e]-1,2-thiazine-6-sulfonamide 1,1-dioxide 24 3-[(cyclopropylamino)methyl]-2-(3-methoxypropyl)-1,1-dioxo-2H-1,7,2-thieno[3,2-e][1,2]thiazine-6-sulfonamide hydrochloride | Compound 17i9
TypeSmall organic molecule
Emp. Form.C14H21N3O5S3
Mol. Mass.407.529
SMILESCOCCCN1C(CNC2CC2)=Cc2cc(sc2S1(=O)=O)S(N)(=O)=O