Reaction Details
TargetCarbonic anhydrase 2
LigandBDBM11407
Substrate/CompetitorBDBM11402
Meas. Tech.In vitro binding of inhibitor to hCA-II
Ki 0.15±n/a nM
Citation Chen, HHGross, SLiao, JMcLaughlin, MDean, TSly, WSMay, JA 2H-Thieno[3,2-e]- and [2,3-e]-1,2-thiazine-6-sulfonamide 1,1-dioxides as ocular hypotensive agents: synthesis, carbonic anhydrase inhibition and evaluation in the rabbit. Bioorg Med Chem8:957-75 (2000) 
 
Carbonic anhydrase 2
Name:Carbonic anhydrase 2
Type:Enzyme
Mol. Mass.:29250.71
Organism:Homo sapiens (Human)
Description:P00918
Residue:260
BDBM11407
BDBM11402
NameBDBM11407
Synonyms:2H-Thieno[3,2-e]-1,2-thiazine-6-sulfonamide 1,1-dioxide 14 3-{[bis(2-methoxyethyl)amino]methyl}-1,1-dioxo-2-propyl-2H-1,7,2-thieno[3,2-e][1,2]thiazine-6-sulfonamide hydrochloride | Compound 17c2
TypeSmall organic molecule
Emp. Form.C16H27N3O6S3
Mol. Mass.453.597
SMILESCCCN1C(CN(CCOC)CCOC)=Cc2cc(sc2S1(=O)=O)S(N)(=O)=O