Reaction Details
TargetCarbonic anhydrase 2
LigandBDBM11414
Substrate/CompetitorBDBM11402
Meas. Tech.In vitro binding of inhibitor to hCA-II
Ki 0.22±n/a nM
Citation Chen, HHGross, SLiao, JMcLaughlin, MDean, TSly, WSMay, JA 2H-Thieno[3,2-e]- and [2,3-e]-1,2-thiazine-6-sulfonamide 1,1-dioxides as ocular hypotensive agents: synthesis, carbonic anhydrase inhibition and evaluation in the rabbit. Bioorg Med Chem8:957-75 (2000) 
 
Carbonic anhydrase 2
Name:Carbonic anhydrase 2
Type:Enzyme
Mol. Mass.:29250.71
Organism:Homo sapiens (Human)
Description:P00918
Residue:260
BDBM11414
BDBM11402
NameBDBM11414
Synonyms:2-(2-Methoxyethyl)-3-[(4-morpholinyl)methyl]-2H-thieno-[3,2-e]-1,2-thiazine-6-sulfonamide 1,1-dioxide 2H-Thieno[3,2-e]-1,2-thiazine-6-sulfonamide 1,1-dioxide 21 | Compound 17h1
TypeSmall organic molecule
Emp. Form.C14H21N3O6S3
Mol. Mass.423.528
SMILESCOCCN1C(CN2CCOCC2)=Cc2cc(sc2S1(=O)=O)S(N)(=O)=O