Reaction Details
TargetCarbonic anhydrase 2
LigandBDBM11419
Substrate/CompetitorBDBM10856
Meas. Tech.CA Inhibition Assay
IC50 2.01±n/a nM
Citation Chen, HHGross, SLiao, JMcLaughlin, MDean, TSly, WSMay, JA 2H-Thieno[3,2-e]- and [2,3-e]-1,2-thiazine-6-sulfonamide 1,1-dioxides as ocular hypotensive agents: synthesis, carbonic anhydrase inhibition and evaluation in the rabbit. Bioorg Med Chem8:957-75 (2000) 
 
Carbonic anhydrase 2
Name:Carbonic anhydrase 2
Type:Enzyme
Mol. Mass.:29250.71
Organism:Homo sapiens (Human)
Description:P00918
Residue:260
BDBM11419
BDBM10856
NameBDBM11419
Synonyms:2-[(4-Methoxyphenyl)methyl]-3-[(4-morpholinyl)methyl]-2H-thieno[3,2-e]-1,2-thiazine-6-sulfonamide 1,1-dioxide hydrochloride 2H-Thieno[3,2-e]-1,2-thiazine-6-sulfonamide 1,1-dioxide 26 | Compound 17j1
TypeSmall organic molecule
Emp. Form.C19H23N3O6S3
Mol. Mass.485.597
SMILESCOc1ccc(CN2C(CN3CCOCC3)=Cc3cc(sc3S2(=O)=O)S(N)(=O)=O)cc1