Reaction Details
TargetCarbonic anhydrase 2
LigandBDBM11423
Substrate/CompetitorBDBM10856
Meas. Tech.CA Inhibition Assay
IC50 1.50±n/a nM
Citation Chen, HHGross, SLiao, JMcLaughlin, MDean, TSly, WSMay, JA 2H-Thieno[3,2-e]- and [2,3-e]-1,2-thiazine-6-sulfonamide 1,1-dioxides as ocular hypotensive agents: synthesis, carbonic anhydrase inhibition and evaluation in the rabbit. Bioorg Med Chem8:957-75 (2000) 
 
Carbonic anhydrase 2
Name:Carbonic anhydrase 2
Type:Enzyme
Mol. Mass.:29250.71
Organism:Homo sapiens (Human)
Description:P00918
Residue:260
BDBM11423
BDBM10856
NameBDBM11423
Synonyms:2-[(4-Morpholinyl)phenyl]-3-[(4-morpholinyl)methyl]-2H-thieno[3,2-e]-1,2-thiazine-6-sulfonamide 1,1-dioxide hydrochloride 2H-Thieno[3,2-e]-1,2-thiazine-6-sulfonamide 1,1-dioxide 30 | Compound 17n1
TypeSmall organic molecule
Emp. Form.C21H26N4O6S3
Mol. Mass.526.649
SMILESNS(=O)(=O)c1cc2C=C(CN3CCOCC3)N(c3ccc(cc3)N3CCOCC3)S(=O)(=O)c2s1