Reaction Details
TargetCarbonic anhydrase 2
LigandBDBM11424
Substrate/CompetitorBDBM11402
Meas. Tech.In vitro binding of inhibitor to hCA-II
Ki 0.2±n/a nM
Citation Chen, HHGross, SLiao, JMcLaughlin, MDean, TSly, WSMay, JA 2H-Thieno[3,2-e]- and [2,3-e]-1,2-thiazine-6-sulfonamide 1,1-dioxides as ocular hypotensive agents: synthesis, carbonic anhydrase inhibition and evaluation in the rabbit. Bioorg Med Chem8:957-75 (2000) 
 
Carbonic anhydrase 2
Name:Carbonic anhydrase 2
Type:Enzyme
Mol. Mass.:29250.71
Organism:Homo sapiens (Human)
Description:P00918
Residue:260
BDBM11424
BDBM11402
NameBDBM11424
Synonyms:2-(3-Hydroxypropyl)-3-(4-morpholinylmethyl)-2H-thieno-[3,2-e]-1,2-thiazine-6-sulfonamide 1,1-dioxide 2H-Thieno[3,2-e]-1,2-thiazine-6-sulfonamide 1,1-dioxide 31 | Compound 17o1
TypeSmall organic molecule
Emp. Form.C14H21N3O6S3
Mol. Mass.423.528
SMILESNS(=O)(=O)c1cc2C=C(CN3CCOCC3)N(CCCO)S(=O)(=O)c2s1