Reaction Details
TargetCarbonic anhydrase 4
LigandBDBM11416
Substrate/CompetitorBDBM10856
Meas. Tech.CA Inhibition Assay
IC50 23.6±n/a nM
Citation Chen, HHGross, SLiao, JMcLaughlin, MDean, TSly, WSMay, JA 2H-Thieno[3,2-e]- and [2,3-e]-1,2-thiazine-6-sulfonamide 1,1-dioxides as ocular hypotensive agents: synthesis, carbonic anhydrase inhibition and evaluation in the rabbit. Bioorg Med Chem8:957-75 (2000) 
 
Carbonic anhydrase 4
Name:Carbonic anhydrase 4
Type:Enzyme
Mol. Mass.:35037.98
Organism:Homo sapiens (Human)
Description:P22748
Residue:312
BDBM11416
BDBM10856
NameBDBM11416
Synonyms:2-(3-Methoxypropyl)-3-[(4-morpholinyl)methyl]-2H-thieno-[3,2-e]-1,2-thiazine-6-sulfonamide 1,1-dioxide hydrochloride 2H-Thieno[3,2-e]-1,2-thiazine-6-sulfonamide 1,1-dioxide 23 | Compound 17i1
TypeSmall organic molecule
Emp. Form.C15H23N3O6S3
Mol. Mass.437.555
SMILESCOCCCN1C(CN2CCOCC2)=Cc2cc(sc2S1(=O)=O)S(N)(=O)=O